Target
ALK tyrosine kinase receptor
Ligand
BDBM261677
Substrate
Meas. Tech.
ALK Kinase Inhibition Activity Assay
IC50
1000±n/a nM
Citation
 Xiao, DXu, XLiu, XHu, YYu, HLiu, ZPeng, YSun, YLuo, HKong, FHan, YSun, J Substituted 2-aminopyridine protein kinase inhibitor US Patent  US9708295 Publication Date 7/18/2017 
Target
Name:
ALK tyrosine kinase receptor
Synonyms:
ALK ALK_HUMAN CD_antigen: CD246
Type:
Protein
Mol. Mass.:
176453.10
Organism:
Homo sapiens (Human)
Description:
Q9UM73
Residue:
1620
  
Inhibitor
Name:
BDBM261677
Synonyms:
US9708295, 16
Type:
Small organic molecule
Emp. Form.:
C20H22FN5O
Mol. Mass.:
367.42
SMILES:
Nc1ncc(cc1COc1cccc(F)c1)-c1cnn(c1)C1CCNCC1
: