Target
ALK tyrosine kinase receptor
Ligand
BDBM261682
Substrate
Meas. Tech.
ALK Kinase Inhibition Activity Assay
IC50
75.7±n/a nM
Citation
 Xiao, DXu, XLiu, XHu, YYu, HLiu, ZPeng, YSun, YLuo, HKong, FHan, YSun, J Substituted 2-aminopyridine protein kinase inhibitor US Patent  US9708295 Publication Date 7/18/2017 
Target
Name:
ALK tyrosine kinase receptor
Synonyms:
ALK ALK_HUMAN CD_antigen: CD246
Type:
Protein
Mol. Mass.:
176453.10
Organism:
Homo sapiens (Human)
Description:
Q9UM73
Residue:
1620
  
Inhibitor
Name:
BDBM261682
Synonyms:
US9708295, 23
Type:
Small organic molecule
Emp. Form.:
C25H28Cl2FN5O2
Mol. Mass.:
520.427
SMILES:
COc1cc(ncc1-c1cnc(N)c(OC(C)c2c(Cl)ccc(F)c2Cl)c1)N1CCN(C)C[C@H]1C
: