Target
ALK tyrosine kinase receptor
Ligand
BDBM261699
Substrate
Meas. Tech.
ALK Kinase Inhibition Activity Assay
IC50
664±n/a nM
Citation
 Xiao, DXu, XLiu, XHu, YYu, HLiu, ZPeng, YSun, YLuo, HKong, FHan, YSun, J Substituted 2-aminopyridine protein kinase inhibitor US Patent  US9708295 Publication Date 7/18/2017 
Target
Name:
ALK tyrosine kinase receptor
Synonyms:
ALK ALK_HUMAN CD_antigen: CD246
Type:
Protein
Mol. Mass.:
176453.10
Organism:
Homo sapiens (Human)
Description:
Q9UM73
Residue:
1620
  
Inhibitor
Name:
BDBM261699
Synonyms:
US9708295, 41
Type:
Small organic molecule
Emp. Form.:
C25H26ClF3N4O2
Mol. Mass.:
506.948
SMILES:
COc1cc(N2CCNCC2)c(Cl)cc1-c1cnc(N)c(OC(C)c2cc(F)ccc2C(F)F)c1
: