Target
ALK tyrosine kinase receptor
Ligand
BDBM261710
Substrate
Meas. Tech.
ALK Kinase Inhibition Activity Assay
IC50
6.90±n/a nM
Citation
 Xiao, DXu, XLiu, XHu, YYu, HLiu, ZPeng, YSun, YLuo, HKong, FHan, YSun, J Substituted 2-aminopyridine protein kinase inhibitor US Patent  US9708295 Publication Date 7/18/2017 
Target
Name:
ALK tyrosine kinase receptor
Synonyms:
ALK ALK_HUMAN CD_antigen: CD246
Type:
Protein
Mol. Mass.:
176453.10
Organism:
Homo sapiens (Human)
Description:
Q9UM73
Residue:
1620
  
Inhibitor
Name:
BDBM261710
Synonyms:
US9708295, 52
Type:
Small organic molecule
Emp. Form.:
C25H25Cl2FN4O3
Mol. Mass.:
519.395
SMILES:
C[C@@H](Oc1cc(cnc1N)-c1cnc(C2=CCNCC2)c(OCCO)c1)c1c(Cl)ccc(F)c1Cl
: