Target
Plasma kallikrein
Ligand
BDBM283353
Substrate
Meas. Tech.
In Vitro Enzyme Inhibition
IC50
<100±n/a nM
Citation
 McDonald, AQian, S Therapeutic inhibitory compounds US Patent  US10266515 Publication Date 4/23/2019 
Target
Name:
Plasma kallikrein
Synonyms:
Fletcher factor KLKB1 Kallikrein Plasma kallikrein heavy chain Plasma prekallikrein
Type:
Protein
Mol. Mass.:
71391.16
Organism:
Homo sapiens (Human)
Description:
P03952
Residue:
638
  
Inhibitor
Name:
BDBM283353
Synonyms:
N-((3-chloro-6-fluoro-1H-indol-5-yl)methyl)-2- ((3-cyanoquinolin-6-yl)methyl)isonicotinamide US10266515, Example 5 US11021463, Example 5 | US9611252, Example 5
Type:
Small organic molecule
Emp. Form.:
C26H17ClFN5O
Mol. Mass.:
469.897
SMILES:
Fc1cc2[nH]cc(Cl)c2cc1CNC(=O)c1ccnc(Cc2ccc3ncc(cc3c2)C#N)c1
: