Target
N-lysine methyltransferase SMYD2
Ligand
BDBM378750
Substrate
Meas. Tech.
SMYD2 Biochemical Assay
IC50
7.80±n/a nM
Citation
 Foley, MAKuntz, KWMills, JEMitchell, LHMunchhof, MJHarvey, DM Substituted 1,2,3-triazoles as SMYD inhibitors for treating cancer US Patent  US10266526 Publication Date 4/23/2019 
Target
Name:
N-lysine methyltransferase SMYD2
Synonyms:
HSKM-B KMT3C N-lysine methyltransferase SMYD2 SET and MYND domain-containing protein 2 (SMYD2) SMYD2_HUMAN
Type:
Enzyme
Mol. Mass.:
49689.57
Organism:
Homo sapiens (Human)
Description:
Q9NRG4
Residue:
433
  
Inhibitor
Name:
BDBM378750
Synonyms:
N-(1-((1-benzyl-1H-pyrazol-4-yl)methyl)azetidin-3-yl)-5-cyclopropylpyridazine-3-carboxamide | US10266526, Compound 933
Type:
Small organic molecule
Emp. Form.:
C22H24N6O
Mol. Mass.:
388.4656
SMILES:
O=C(NC1CN(Cc2cnn(Cc3ccccc3)c2)C1)c1cc(cnn1)C1CC1
: