Target
N-lysine methyltransferase SMYD2
Ligand
BDBM378810
Substrate
Meas. Tech.
SMYD2 Biochemical Assay
IC50
16.0±n/a nM
Citation
 Foley, MAKuntz, KWMills, JEMitchell, LHMunchhof, MJHarvey, DM Substituted 1,2,3-triazoles as SMYD inhibitors for treating cancer US Patent  US10266526 Publication Date 4/23/2019 
Target
Name:
N-lysine methyltransferase SMYD2
Synonyms:
HSKM-B KMT3C N-lysine methyltransferase SMYD2 SET and MYND domain-containing protein 2 (SMYD2) SMYD2_HUMAN
Type:
Enzyme
Mol. Mass.:
49689.57
Organism:
Homo sapiens (Human)
Description:
Q9NRG4
Residue:
433
  
Inhibitor
Name:
BDBM378810
Synonyms:
1-cyclopropyl-N-(1-((1-(4-methylbenzyl)-1H-pyrazol-4-yl)methyl)azetidin-3-yl)-1H-1,2,3-triazole-4-carboxamide | US10266526, Compound 993
Type:
Small organic molecule
Emp. Form.:
C21H25N7O
Mol. Mass.:
391.4695
SMILES:
Cc1ccc(Cn2cc(CN3CC(C3)NC(=O)c3cn(nn3)C3CC3)cn2)cc1
: