Target
A disintegrin and metalloproteinase with thrombospondin motifs 5 [262-930,L692P]
Ligand
BDBM24020
Substrate
BDBM23993
Meas. Tech.
ADAMTS-5 Inhibition Assay
IC50
7500±n/a nM
Citation
 Bursavich, MGGilbert, AMLombardi, SGeorgiadis, KEReifenberg, EFlannery, CRMorris, EA 5'-Phenyl-3'H-spiro[indoline-3,2'-[1,3,4]thiadiazol]-2-one inhibitors of ADAMTS-5 (aggrecanase-2). Bioorg Med Chem Lett 17:5630-3 (2007)  
Target
Name:
A disintegrin and metalloproteinase with thrombospondin motifs 5 [262-930,L692P]
Synonyms:
A disintegrin and metalloproteinase with thrombospondin motifs 5 ADAMTS-5 (Aggrecanase-2) ADAMTS5 ADMP2 | ATS5_HUMAN
Type:
Metalloprotease
Mol. Mass.:
73728.14
Organism:
Homo sapiens (Human)
Description:
Q9UNA0[262-930,L692P]
Residue:
669
  
Inhibitor
Name:
BDBM24020
Synonyms:
5'-(4-methoxyphenyl)-1-methyl-1,2-dihydro-3'H-spiro[indole-3,2'-[1,3,4]thiadiazole]-2-one | thiadiazole derivative, 32
Type:
Small organic molecule
Emp. Form.:
C17H15N3O2S
Mol. Mass.:
325.385
SMILES:
COc1ccc(cc1)C1=NNC2(S1)C(=O)N(C)c1ccccc21
:
Substrate
Name:
BDBM23993
Synonyms:
Peptide contains an aggrecanase cleavage site | QF-peptide
Type:
Fluorescent peptide substrate
Emp. Form.:
Mol. Mass.:
SMILES:
: