Target
A disintegrin and metalloproteinase with thrombospondin motifs 4
Ligand
BDBM24031
Substrate
Fluorescent peptide WAAG-3R
Meas. Tech.
Aggrecanase-1 Inhibition Assay
pH
7.5±n/a
Temperature
303.15±n/a K
IC50
4600±n/a nM
Citation
 Xiang, JSHu, YRush, TSThomason, JRIpek, MSum, PEAbrous, LSabatini, JJGeorgiadis, KReifenberg, EMajumdar, MMorris, EATam, S Synthesis and biological evaluation of biphenylsulfonamide carboxylate aggrecanase-1 inhibitors. Bioorg Med Chem Lett 16:311-6 (2006)  
Target
Name:
A disintegrin and metalloproteinase with thrombospondin motifs 4
Synonyms:
A disintegrin and metalloproteinase with thrombospondin motifs 4 (ADAMTS-4) ATS4_HUMAN KIAA0688 | Metalloproteinase with thrombospondin motifs 4 (ADAMTS-4)
Type:
Enzyme
Mol. Mass.:
90214.54
Organism:
Homo sapiens (Human)
Description:
O75173
Residue:
837
  
Inhibitor
Name:
BDBM24031
Synonyms:
(2R)-2-{[4-(4-hydroxyphenyl)benzene]sulfonamido}-3-methylbutanoic acid | biphenylsulfonamide carboxylate, 8
Type:
Small organic molecule
Emp. Form.:
C17H19NO5S
Mol. Mass.:
349.401
SMILES:
CC(C)[C@@H](NS(=O)(=O)c1ccc(cc1)-c1ccc(O)cc1)C(O)=O
:
Substrate
Name:
Fluorescent peptide WAAG-3R
Synonyms:
Type:
Peptide
Mol. Mass.:
1954.08
Organism:
Description:
Residue:
19
ATEGEARGSVIDAPDNPKK