Target
Potassium voltage-gated channel subfamily H member 2
Ligand
BDBM24058
Substrate
BDBM24064
Meas. Tech.
hERG Radioligand Competition Assay
pH
7.4±n/a
Temperature
295.15±n/a K
IC50
2400±n/a nM
Citation
 Fraley, MEGarbaccio, RMArrington, KLHoffman, WFTasber, ESColeman, PJBuser, CAWalsh, ESHamilton, KFernandes, CSchaber, MDLobell, RBTao, WSouth, VJYan, YKuo, LCPrueksaritanont, TShu, CTorrent, MHeimbrook, DCKohl, NEHuber, HEHartman, GD Kinesin spindle protein (KSP) inhibitors. Part 2: the design, synthesis, and characterization of 2,4-diaryl-2,5-dihydropyrrole inhibitors of the mitotic kinesin KSP. Bioorg Med Chem Lett 16:1775-9 (2006)  
Target
Name:
Potassium voltage-gated channel subfamily H member 2
Synonyms:
1,3-beta-glucan synthase component GLS2 ERG Eag-related protein 1 Ether-a-go-go-related gene (HERG) Ether-a-go-go-related gene potassium channel 1 Ether-a-go-go-related gene potassium channel 1 (hERG1) Ether-a-go-go-related protein 1 H-ERG KCNH2 Potassium voltage-gated channel subfamily H member 2 (hERG) Voltage-gated potassium channel subunit Kv11.1 hERG Potassium Channel 1 | putative potassium channel subunit
Type:
Multi-pass membrane protein
Mol. Mass.:
126672.65
Organism:
Homo sapiens (Human)
Description:
Q12809
Residue:
1159
  
Inhibitor
Name:
BDBM24058
Synonyms:
(2S)-2-amino-1-[(2S)-4-(2,5-difluorophenyl)-2-phenyl-2,5-dihydro-1H-pyrrol-1-yl]-3-methylbutan-1-one | dihydropyrrole, 17
Type:
Small organic molecule
Emp. Form.:
C21H22F2N2O
Mol. Mass.:
356.409
SMILES:
[H][C@]1(C=C(CN1C(=O)[C@@H](N)C(C)C)c1cc(F)ccc1F)c1ccccc1
:
Substrate
Name:
BDBM24064
Synonyms:
L-706,000 MK-499 [35S]-MK499
Type:
radiolabeled ligand
Emp. Form.:
C25H29N3O4S
Mol. Mass.:
467.58
SMILES:
CS(=O)(=O)Nc1ccc2OC3(CCN(CC3)[C@@H]3CCc4cc(ccc4C3)C#N)C[C@@H](O)c2c1
: