Target
Muscarinic acetylcholine receptor M1
Ligand
BDBM261730
Substrate
Meas. Tech.
M1 PAM Assay
EC50
11.0±n/a nM
Citation
 Groebke Zbinden, KPinard, ERyckmans, T Flouro-naphthyl derivatives US Patent  US9708302 Publication Date 7/18/2017 
Target
Name:
Muscarinic acetylcholine receptor M1
Synonyms:
ACM1_HUMAN Cholinergic receptor, muscarinic 1 | Cholinergic, muscarinic M1
Type:
Protein
Mol. Mass.:
51442.54
Organism:
Homo sapiens (Human)
Description:
P11229
Residue:
460
  
Inhibitor
Name:
BDBM261730
Synonyms:
1-fluoro-N- ((3RS,4SR)-3- hydroxytetrahydro- 2H-pyran-4-yl)-4-(4- (1-methyl-1H- pyrazol-4-yl)benzyl)- 2-naphthamide | US9708302, 16
Type:
Small organic molecule
Emp. Form.:
C27H26FN3O3
Mol. Mass.:
459.512
SMILES:
Cn1cc(cn1)-c1ccc(Cc2cc(C(=O)N[C@H]3CCOC[C@@H]3O)c(F)c3ccccc23)cc1
: