Target
Muscarinic acetylcholine receptor M1
Ligand
BDBM261715
Substrate
Meas. Tech.
M1 PAM Assay
EC50
101±n/a nM
Citation
 Groebke Zbinden, KPinard, ERyckmans, T Flouro-naphthyl derivatives US Patent  US9708302 Publication Date 7/18/2017 
Target
Name:
Muscarinic acetylcholine receptor M1
Synonyms:
ACM1_RAT Chrm-1 cholinergic receptor, muscarinic 1
Type:
Enzyme Catalytic Domain
Mol. Mass.:
51390.46
Organism:
RAT
Description:
P08482
Residue:
460
  
Inhibitor
Name:
BDBM261715
Synonyms:
4-((6-Chloropyridin-3-yl)methyl)-1-fluoro-N-((1SR,2SR)-2-hydroxycyclohexyl)-2-naphthamide US9708302, 3
Type:
Small organic molecule
Emp. Form.:
C23H22ClFN2O2
Mol. Mass.:
412.884
SMILES:
O[C@H]1CCCC[C@@H]1NC(=O)c1cc(Cc2ccc(Cl)nc2)c2ccccc2c1F
: