Target
Platelet-derived growth factor receptor alpha
Ligand
BDBM50086441
Substrate
Meas. Tech.
Kinase Inhibition Assays
IC50
890±n/a nM
Citation
 Yang, SWei, Y 3-acetylenyl-pyrazole-pyrimidine derivative, and preparation method therefor and uses thereof US Patent  US10266537 Publication Date 4/23/2019 
Target
Name:
Platelet-derived growth factor receptor alpha
Synonyms:
Alpha-type platelet-derived growth factor receptor PDGFRA PGFRA_HUMAN Platelet-derived growth factor receptor alpha (PDGFRA) RHEPDGFRA
Type:
Protein
Mol. Mass.:
122633.38
Organism:
Homo sapiens (Human)
Description:
P16234
Residue:
1089
  
Inhibitor
Name:
BDBM50086441
Synonyms:
CHEMBL3426225 | US10266537, Compound 3
Type:
Small organic molecule
Emp. Form.:
C30H31F3N8O
Mol. Mass.:
576.6153
SMILES:
CCn1nc(C#Cc2cc(ccc2C)C(=O)Nc2ccc(CN3CCN(C)CC3)c(c2)C(F)(F)F)c2c(N)ncnc12
: