Target
Proto-oncogene tyrosine-protein kinase Src [1-530]
Ligand
BDBM378897
Substrate
Meas. Tech.
Kinase Inhibition Assays
IC50
139±n/a nM
Citation
 Yang, SWei, Y 3-acetylenyl-pyrazole-pyrimidine derivative, and preparation method therefor and uses thereof US Patent  US10266537 Publication Date 4/23/2019 
Target
Name:
Proto-oncogene tyrosine-protein kinase Src [1-530]
Synonyms:
Proto-oncogene tyrosine-protein kinase Src (aa 1-530) SRC1 c-Src (aa 1-530)
Type:
Mol. Mass.:
59200.93
Organism:
Homo sapiens (Human)
Description:
P12931[1-530]
Residue:
530
  
Inhibitor
Name:
BDBM378897
Synonyms:
US10266537, Compound 12
Type:
Small organic molecule
Emp. Form.:
C29H25F3N8O
Mol. Mass.:
558.557
SMILES:
CC(C)n1nc(C#Cc2cc(ccc2C)C(=O)Nc2cc(cc(c2)C(F)(F)F)-n2cnc(C)c2)c2c(N)ncnc12
: