Target
Histone-lysine N-methyltransferase EZH2
Ligand
BDBM378891
Substrate
Meas. Tech.
EZH2 enzymatic activity
IC50
5.00±n/a nM
Citation
 Marx, MALee, MRGalemmo, RABobinski, TP EZH2 inhibitors US Patent  US10266542 Publication Date 4/23/2019 
Target
Name:
Histone-lysine N-methyltransferase EZH2
Synonyms:
ENX-1 EZH2_HUMAN Histone-lysine N-methyltransferase EZH2 Lysine N-methyltransferase 6
Type:
Protein
Mol. Mass.:
85367.84
Organism:
Homo sapiens (Human)
Description:
Q15910
Residue:
746
  
Inhibitor
Name:
BDBM378891
Synonyms:
7-((5,8-dichloro-7-(ethyl(tetrahydro-2H-pyran-4-yl)amino)-1-oxo-3,4-dihydroisoquinolin-2(1H)-yl)methyl)-4-methylfuro[3,2-c]pyridin-6(5H)-on | US10266542, Example 3
Type:
Small organic molecule
Emp. Form.:
C25H27Cl2N3O4
Mol. Mass.:
504.406
SMILES:
CCN(C1CCOCC1)c1cc(Cl)c2CCN(Cc3c4occc4c(C)[nH]c3=O)C(=O)c2c1Cl
: