Target
Mitotic checkpoint serine/threonine-protein kinase BUB1
Ligand
BDBM379027
Substrate
Meas. Tech.
Bub1 Kinase Assay
IC50
7.40±n/a nM
Citation
 Hitchcock, MMengel, APütter, VSiemeister, GWengner, AMBriem, HEis, KSchulze, VFernandez-Montalvan, AEPrechtl, SHolton, SFanghänel, JLienau, PPreusse, CGnoth, MJ Substituted benzylindazoles for use as Bub1 kinase inhibitors in the treatment of hyperproliferative diseases US Patent  US10266548 Publication Date 4/23/2019 
Target
Name:
Mitotic checkpoint serine/threonine-protein kinase BUB1
Synonyms:
BUB1 BUB1L hBUB1
Type:
PROTEIN
Mol. Mass.:
122372.31
Organism:
Homo sapiens (Human)
Description:
ChEMBL_1510603
Residue:
1085
  
Inhibitor
Name:
BDBM379027
Synonyms:
Preparation of [2,4-dichloro-3-({3-[5-methoxy-4-(pyridin-4-ylamino)pyrimidin-2-yl]-1H-indazol-1-yl}methyl)phenyl]methanol US10266548, Example 8-1
Type:
Small organic molecule
Emp. Form.:
C25H20Cl2N6O2
Mol. Mass.:
507.371
SMILES:
COc1cnc(nc1Nc1ccncc1)-c1nn(Cc2c(Cl)ccc(CO)c2Cl)c2ccccc12
: