Target
Leukotriene A-4 hydrolase
Ligand
BDBM24262
Substrate
BDBM23991
Meas. Tech.
Peptidase Assay
pH
7.5±n/a
Temperature
295.15±n/a K
IC50
25±n/a nM
Km
1000000±n/a nM
Citation
 Kirkland, TAAdler, MBauman, JGChen, MHaeggström, JZKing, BKochanny, MJLiang, AMMendoza, LPhillips, GBThunnissen, MTrinh, LWhitlow, MYe, BYe, HParkinson, JGuilford, WJ Synthesis of glutamic acid analogs as potent inhibitors of leukotriene A4 hydrolase. Bioorg Med Chem 16:4963-83 (2008)  
Target
Name:
Leukotriene A-4 hydrolase
Synonyms:
LKHA4_HUMAN LTA4 Leukotriene A(4) hydrolase Leukotriene A4 hydrolase
Type:
Hydrolase; metalloprotease
Mol. Mass.:
69280.41
Organism:
Homo sapiens (Human)
Description:
Human recombinant LTA4H.
Residue:
611
  
Inhibitor
Name:
BDBM24262
Synonyms:
(2S)-2-amino-N-[4-(benzyloxy)phenyl]-N'-hydroxypentanediamide | Modified amino acid analog, 6d
Type:
Small organic molecule
Emp. Form.:
C18H21N3O4
Mol. Mass.:
343.377
SMILES:
N[C@@H](CCC(=O)Nc1ccc(OCc2ccccc2)cc1)C(=O)NO
:
Substrate
Name:
BDBM23991
Synonyms:
(2S)-2-amino-N-(4-nitrophenyl)propanamide Alanine para-nitroanilide | L-Alanine-4-nitroanilide
Type:
Emp. Form.:
C9H11N3O3
Mol. Mass.:
209.2019
SMILES:
C[C@H](N)C(=O)Nc1ccc(cc1)[N+]([O-])=O
: