Target
Serine/threonine-protein kinase ULK1
Ligand
BDBM379224
Substrate
Meas. Tech.
ULK1 inhibition assay
IC50
<200±n/a nM
Citation
 Shaw, RJEgan, DFCosford, NTurk, BVamos, MPanickar, DRChun, MSheffler, D ULK1 inhibitors and methods using same US Patent  US10266549 Publication Date 4/23/2019 
Target
Name:
Serine/threonine-protein kinase ULK1
Synonyms:
ATG1 KIAA0722 ULK1_HUMAN hATG1
Type:
PROTEIN
Mol. Mass.:
112661.80
Organism:
Homo sapiens (Human)
Description:
ChEMBL_1510275
Residue:
1050
  
Inhibitor
Name:
BDBM379224
Synonyms:
US10266549, Example 130a | US10774092, Example 130a
Type:
Small organic molecule
Emp. Form.:
C23H20F3N5O
Mol. Mass.:
439.433
SMILES:
FC(F)(F)c1cnc(Nc2ccc3NC(=O)CCc3c2)nc1NC1Cc2ccccc2C1
: