Target
Serine/threonine-protein kinase ULK1
Ligand
BDBM379234
Substrate
Meas. Tech.
ULK1 inhibition assay
IC50
<200±n/a nM
Citation
 Shaw, RJEgan, DFCosford, NTurk, BVamos, MPanickar, DRChun, MSheffler, D ULK1 inhibitors and methods using same US Patent  US10266549 Publication Date 4/23/2019 
Target
Name:
Serine/threonine-protein kinase ULK1
Synonyms:
ATG1 KIAA0722 ULK1_HUMAN hATG1
Type:
PROTEIN
Mol. Mass.:
112661.80
Organism:
Homo sapiens (Human)
Description:
ChEMBL_1510275
Residue:
1050
  
Inhibitor
Name:
BDBM379234
Synonyms:
US10266549, Example 138* | US10774092, Example 138*
Type:
Small organic molecule
Emp. Form.:
C19H14F3N5O3
Mol. Mass.:
417.3414
SMILES:
NC(=O)c1cccc(Nc2ncc(c(Nc3ccc4OCOc4c3)n2)C(F)(F)F)c1
: