Target
Serine/threonine-protein kinase ULK1
Ligand
BDBM379320
Substrate
Meas. Tech.
ULK1 inhibition assay
IC50
<200±n/a nM
Citation
 Shaw, RJEgan, DFCosford, NTurk, BVamos, MPanickar, DRChun, MSheffler, D ULK1 inhibitors and methods using same US Patent  US10266549 Publication Date 4/23/2019 
Target
Name:
Serine/threonine-protein kinase ULK1
Synonyms:
ATG1 KIAA0722 ULK1_HUMAN hATG1
Type:
PROTEIN
Mol. Mass.:
112661.80
Organism:
Homo sapiens (Human)
Description:
ChEMBL_1510275
Residue:
1050
  
Inhibitor
Name:
BDBM379320
Synonyms:
N4-cyclopropyl-N2-(pyrimidin-5-yl)-5-(trifluoromethyl) pyrimidine-2,4-diamine US10774092, Example 203
Type:
Small organic molecule
Emp. Form.:
C12H11F3N6
Mol. Mass.:
296.2511
SMILES:
FC(F)(F)c1cnc(Nc2cncnc2)nc1NC1CC1
: