Target
DNA topoisomerase 1
Ligand
BDBM379474
Substrate
Meas. Tech.
E. coli Topoisomerase I Relaxation Activity Inhibition Assay
IC50
3900±n/a nM
Citation
 Tse-Dinh, YSun, D Bacterial topoisomerase I inhibitors with antibacterial activity US Patent  US10266550 Publication Date 4/23/2019 
Target
Name:
DNA topoisomerase 1
Synonyms:
DNA topoisomerase I Relaxing enzyme TOP1_ECOLI supX | topA
Type:
Enzyme Catalytic Domain
Mol. Mass.:
97364.79
Organism:
Escherichia coli (strain K12)
Description:
P06612
Residue:
865
  
Inhibitor
Name:
BDBM379474
Synonyms:
US10266550, Compound 11i
Type:
Small organic molecule
Emp. Form.:
C22H20FN3O4
Mol. Mass.:
409.4103
SMILES:
Nc1ccc2c(c1)oc1c(NC3CCCCC3)c(F)cc3c1n2cc(C(O)=O)c3=O
: