Target
Rho-associated protein kinase 2
Ligand
BDBM380174
Substrate
Meas. Tech.
In Vitro Assay
IC50
<100±n/a nM
Citation
 Glunz, PWZou, YQuan, MLLadziata, V Phthalazinones and isoquinolinones as rock inhibitors US Patent  US9926282 Publication Date 3/27/2018 
Target
Name:
Rho-associated protein kinase 2
Synonyms:
KIAA0619 ROCK2 Rho kinase 2 (ROCKII) Rho-associated protein kinase 2 (ROCK2) Rho-associated protein kinase 2/Transforming protein RhoA Rho-associated, coiled-coil-containing protein kinase II p164 ROCK-2
Type:
Protein
Mol. Mass.:
160885.43
Organism:
Homo sapiens (Human)
Description:
O75116
Residue:
1388
  
Inhibitor
Name:
BDBM380174
Synonyms:
1-(2-hydroxy-2- methylpropyl)-N-[4-(4- oxo-3,4- dihydrophthalazin-1- yl)phenyl]-1H- pyrrolo[2,3-b]pyridine- 3-carboxamide | US9926282, Example 169
Type:
Small organic molecule
Emp. Form.:
C26H23N5O3
Mol. Mass.:
453.4925
SMILES:
CC(C)(O)Cn1cc(C(=O)Nc2ccc(cc2)-c2n[nH]c(=O)c3ccccc23)c2cccnc12
: