Target
Rho-associated protein kinase 1
Ligand
BDBM380211
Substrate
Meas. Tech.
In Vitro Assay
IC50
<100±n/a nM
Citation
 Glunz, PWZou, YQuan, MLLadziata, V Phthalazinones and isoquinolinones as rock inhibitors US Patent  US9926282 Publication Date 3/27/2018 
Target
Name:
Rho-associated protein kinase 1
Synonyms:
ROCK-I ROCK1_HUMAN Rho-associated protein kinase Rho-associated, coiled-coil-containing protein kinase 1 Rho-kinase (ROCK I) p160 ROCK-1 | p160ROCK
Type:
Serine/threonine-protein kinase
Mol. Mass.:
158156.77
Organism:
Homo sapiens (Human)
Description:
Q13464
Residue:
1354
  
Inhibitor
Name:
BDBM380211
Synonyms:
5-tert-butyl-1-methyl-N- [4-(4-oxo-3,4- dihydrophthalazin-1- yl)phenyl]-1H-pyrazole- 3-carboxamide | US9926282, Example 206
Type:
Small organic molecule
Emp. Form.:
C23H23N5O2
Mol. Mass.:
401.461
SMILES:
Cn1nc(cc1C(C)(C)C)C(=O)Nc1ccc(cc1)-c1n[nH]c(=O)c2ccccc12
: