Target
Rho-associated protein kinase 2
Ligand
BDBM380316
Substrate
Meas. Tech.
In Vitro Assay
IC50
<100±n/a nM
Citation
 Glunz, PWZou, YQuan, MLLadziata, V Phthalazinones and isoquinolinones as rock inhibitors US Patent  US9926282 Publication Date 3/27/2018 
Target
Name:
Rho-associated protein kinase 2
Synonyms:
KIAA0619 ROCK2 Rho kinase 2 (ROCKII) Rho-associated protein kinase 2 (ROCK2) Rho-associated protein kinase 2/Transforming protein RhoA Rho-associated, coiled-coil-containing protein kinase II p164 ROCK-2
Type:
Protein
Mol. Mass.:
160885.43
Organism:
Homo sapiens (Human)
Description:
O75116
Residue:
1388
  
Inhibitor
Name:
BDBM380316
Synonyms:
2-methyl-N-[3-methyl-4- (4-oxo-3,4- dihydrophthalazin-1-yl) phenyl]imidazo[1,2-a] pyridine-3-carboxamide | US9926282, Example 311
Type:
Small organic molecule
Emp. Form.:
C24H19N5O2
Mol. Mass.:
409.44
SMILES:
Cc1nc2ccccn2c1C(=O)Nc1ccc(c(C)c1)-c1n[nH]c(=O)c2ccccc12
: