Target
Rho-associated protein kinase 2
Ligand
BDBM380410
Substrate
Meas. Tech.
In Vitro Assay
IC50
<100±n/a nM
Citation
 Glunz, PWZou, YQuan, MLLadziata, V Phthalazinones and isoquinolinones as rock inhibitors US Patent  US9926282 Publication Date 3/27/2018 
Target
Name:
Rho-associated protein kinase 2
Synonyms:
KIAA0619 ROCK2 Rho kinase 2 (ROCKII) Rho-associated protein kinase 2 (ROCK2) Rho-associated protein kinase 2/Transforming protein RhoA Rho-associated, coiled-coil-containing protein kinase II p164 ROCK-2
Type:
Protein
Mol. Mass.:
160885.43
Organism:
Homo sapiens (Human)
Description:
O75116
Residue:
1388
  
Inhibitor
Name:
BDBM380410
Synonyms:
US9926282, Example 405
Type:
Small organic molecule
Emp. Form.:
C25H20N6O3
Mol. Mass.:
452.4647
SMILES:
COc1ccccc1-n1nnc(C(=O)Nc2ccc(cc2)-c2n[nH]c(=O)c3ccccc23)c1C
: