Target
Tyrosine-protein kinase JAK1 [837-1142]
Ligand
BDBM380449
Substrate
Meas. Tech.
Kinase Assay
IC50
<300±n/a nM
Citation
 Li, YZhuo, JMei, S Bipyrazole derivatives as JAK inhibitors US Patent  US9926301 Publication Date 3/27/2018 
Target
Name:
Tyrosine-protein kinase JAK1 [837-1142]
Synonyms:
JAK1 JAK1A JAK1_HUMAN Tyrosine-protein kinase JAK1 (837-1142) | Tyrosine-protein kinase JAK1 (aa 837-1142)
Type:
Mol. Mass.:
35230.04
Organism:
Homo sapiens (Human)
Description:
P23458[837-1142]
Residue:
306
  
Inhibitor
Name:
BDBM380449
Synonyms:
4-{3-(Cyanomethyl)-3-[3-(hydroxymethyl)-3′-methyl-1H,1′H-4,4′-bipyrazol-1-yl]azetidin-1-yl}-2,5-difluoro-N-[(1S)-2,2,2-trifluoro-1-methylethyl]benzamide US9926301, Example 13
Type:
Small organic molecule
Emp. Form.:
C23H22F5N7O2
Mol. Mass.:
523.4585
SMILES:
C[C@H](NC(=O)c1cc(F)c(cc1F)N1CC(CC#N)(C1)n1cc(c(CO)n1)-c1c[nH]nc1C)C(F)(F)F
: