Target
Prostaglandin E2 receptor EP4 subtype
Ligand
BDBM261892
Substrate
Meas. Tech.
Test for Antagonism
Temperature
298.15±n/a K
IC50
15.3±n/a nM
Comments
extracted
Citation
 Peters, OBräuer, NBlume, TTer Laak, AZorn, LNagel, JKaulfuss, SLanger, GKuhnke, J Benzimidazole derivatives as EP4 antagonists US Patent  US9708311 Publication Date 7/18/2017 
Target
Name:
Prostaglandin E2 receptor EP4 subtype
Synonyms:
PE2R4_HUMAN PGE2 receptor EP4 subtype PTGER4 Prostanoid EP4 receptor
Type:
Enzyme
Mol. Mass.:
53134.53
Organism:
Homo sapiens (Human)
Description:
P35408
Residue:
488
  
Inhibitor
Name:
BDBM261892
Synonyms:
2-(9-Ethyl-6-methyl-9H-carbazol-3-yl)-1-(2-methoxyethyl)-4-methyl-1H-benzimidazole-5-carboxylic acid | US9708311, 141
Type:
Small organic molecule
Emp. Form.:
C27H27N3O3
Mol. Mass.:
441.5216
SMILES:
CCn1c2ccc(C)cc2c2cc(ccc12)-c1nc2c(C)c(ccc2n1CCOC)C(O)=O
: