Target
Ectonucleotide pyrophosphatase/phosphodiesterase family member 2
Ligand
BDBM380493
Substrate
Meas. Tech.
Autotaxin Assay
IC50
<500±n/a nM
Citation
 Hutchinson, JHLonergan, DRowbottom, MLai, AG Tetracyclic autotaxin inhibitors US Patent  US9926318 Publication Date 3/27/2018 
Target
Name:
Ectonucleotide pyrophosphatase/phosphodiesterase family member 2
Synonyms:
ATX Autotaxin (ATX) ENPP2 Ectonucleotide Pyrophosphatase/Phosphodiesterase 2 (ENPP2) Extracellular lysophospholipase D PDNP2
Type:
Enzyme
Mol. Mass.:
99007.13
Organism:
Homo sapiens (Human)
Description:
Q13822
Residue:
863
  
Inhibitor
Name:
BDBM380493
Synonyms:
US9926318, 1-11
Type:
Small organic molecule
Emp. Form.:
C24H24N4O5
Mol. Mass.:
448.4712
SMILES:
COc1ccc(Cn2c3CN4[C@@H](Cc3c3ccccc23)C(=O)N(CCCC(O)=O)C4=O)cn1
: