Target
G-protein coupled receptor 6
Ligand
BDBM190893
Substrate
Meas. Tech.
cAMP assay A.2
IC50
29800±n/a nM
Citation
 Brown, JWHitchcock, SHopkins, MKikuchi, SMonenschein, HReichard, HSchleicher, KSun, HMacklin, T Substituted pyrido[3,4-b]pyrazines as GPR6 modulators US Patent  US9708313 Publication Date 7/18/2017 
Target
Name:
G-protein coupled receptor 6
Synonyms:
G-protein coupled receptor 6 (GPR6) GPR6_HUMAN | Sphingosine 1-phosphate receptor GPR6
Type:
Protein
Mol. Mass.:
37886.39
Organism:
Homo sapiens (Human)
Description:
P46095
Residue:
362
  
Inhibitor
Name:
BDBM190893
Synonyms:
US10077266, Example 4 US9708313, 4
Type:
Small organic molecule
Emp. Form.:
C25H34F2N6O3
Mol. Mass.:
504.5727
SMILES:
COCCNC(=O)N1CCc2nc(N3CCC(CC3)Oc3ccc(F)cc3F)c(NC(C)C)nc2C1
: