Target
G-protein coupled receptor 6
Ligand
BDBM190905
Substrate
Meas. Tech.
cAMP assay A.2
IC50
19500±n/a nM
Citation
 Brown, JWHitchcock, SHopkins, MKikuchi, SMonenschein, HReichard, HSchleicher, KSun, HMacklin, T Substituted pyrido[3,4-b]pyrazines as GPR6 modulators US Patent  US9708313 Publication Date 7/18/2017 
Target
Name:
G-protein coupled receptor 6
Synonyms:
G-protein coupled receptor 6 (GPR6) GPR6_HUMAN | Sphingosine 1-phosphate receptor GPR6
Type:
Protein
Mol. Mass.:
37886.39
Organism:
Homo sapiens (Human)
Description:
P46095
Residue:
362
  
Inhibitor
Name:
BDBM190905
Synonyms:
US10077266, Example 16 US9708313, 16
Type:
Small organic molecule
Emp. Form.:
C26H33F2N5O3
Mol. Mass.:
501.5687
SMILES:
CC(C)Nc1nc2CCN(Cc2nc1N1CCC(CC1)Oc1ccc(F)cc1F)C(=O)C1CCCO1
: