Target
G-protein coupled receptor 6
Ligand
BDBM190918
Substrate
Meas. Tech.
cAMP assay A.2
IC50
178000±n/a nM
Citation
 Brown, JWHitchcock, SHopkins, MKikuchi, SMonenschein, HReichard, HSchleicher, KSun, HMacklin, T Substituted pyrido[3,4-b]pyrazines as GPR6 modulators US Patent  US9708313 Publication Date 7/18/2017 
Target
Name:
G-protein coupled receptor 6
Synonyms:
G-protein coupled receptor 6 (GPR6) GPR6_HUMAN | Sphingosine 1-phosphate receptor GPR6
Type:
Protein
Mol. Mass.:
37886.39
Organism:
Homo sapiens (Human)
Description:
P46095
Residue:
362
  
Inhibitor
Name:
BDBM190918
Synonyms:
US10077266, Example 29 US9708313, 29
Type:
Small organic molecule
Emp. Form.:
C23H27F4N5O2
Mol. Mass.:
481.4864
SMILES:
CC1N(CCc2nc(N3CCC(CC3)Oc3ccc(F)cc3F)c(NCC(F)F)nc12)C(C)=O
: