Target
G-protein coupled receptor 6
Ligand
BDBM190920
Substrate
Meas. Tech.
cAMP assay A.2
IC50
208000±n/a nM
Citation
 Brown, JWHitchcock, SHopkins, MKikuchi, SMonenschein, HReichard, HSchleicher, KSun, HMacklin, T Substituted pyrido[3,4-b]pyrazines as GPR6 modulators US Patent  US9708313 Publication Date 7/18/2017 
Target
Name:
G-protein coupled receptor 6
Synonyms:
G-protein coupled receptor 6 (GPR6) GPR6_HUMAN | Sphingosine 1-phosphate receptor GPR6
Type:
Protein
Mol. Mass.:
37886.39
Organism:
Homo sapiens (Human)
Description:
P46095
Residue:
362
  
Inhibitor
Name:
BDBM190920
Synonyms:
US10077266, Example 31 US9708313, 31
Type:
Small organic molecule
Emp. Form.:
C24H29F4N5O3
Mol. Mass.:
511.5124
SMILES:
COCC(=O)N1CCc2nc(N3CCC(CC3)Oc3ccc(F)cc3F)c(NCC(F)F)nc2C1C
: