Target
G-protein coupled receptor 6
Ligand
BDBM190961
Substrate
Meas. Tech.
cAMP assay A.1
IC50
140200±n/a nM
Citation
 Brown, JWHitchcock, SHopkins, MKikuchi, SMonenschein, HReichard, HSchleicher, KSun, HMacklin, T Substituted pyrido[3,4-b]pyrazines as GPR6 modulators US Patent  US9708313 Publication Date 7/18/2017 
Target
Name:
G-protein coupled receptor 6
Synonyms:
G-protein coupled receptor 6 (GPR6) GPR6_HUMAN | Sphingosine 1-phosphate receptor GPR6
Type:
Protein
Mol. Mass.:
37886.39
Organism:
Homo sapiens (Human)
Description:
P46095
Residue:
362
  
Inhibitor
Name:
BDBM190961
Synonyms:
US10077266, Example 74 US9708313, 74
Type:
Small organic molecule
Emp. Form.:
C23H32FN5O2
Mol. Mass.:
429.5309
SMILES:
COc1ccc(OC2CCN(CC2)c2nc3CCN(C)Cc3nc2NC(C)C)c(F)c1
: