Target
G-protein coupled receptor 6
Ligand
BDBM190965
Substrate
Meas. Tech.
cAMP assay A.2
IC50
8800±n/a nM
Citation
 Brown, JWHitchcock, SHopkins, MKikuchi, SMonenschein, HReichard, HSchleicher, KSun, HMacklin, T Substituted pyrido[3,4-b]pyrazines as GPR6 modulators US Patent  US9708313 Publication Date 7/18/2017 
Target
Name:
G-protein coupled receptor 6
Synonyms:
G-protein coupled receptor 6 (GPR6) GPR6_HUMAN | Sphingosine 1-phosphate receptor GPR6
Type:
Protein
Mol. Mass.:
37886.39
Organism:
Homo sapiens (Human)
Description:
P46095
Residue:
362
  
Inhibitor
Name:
BDBM190965
Synonyms:
US10077266, Example 78 US9708313, 78
Type:
Small organic molecule
Emp. Form.:
C23H29ClFN5O
Mol. Mass.:
445.961
SMILES:
CC(C)Nc1nc2CCN(C)Cc2nc1N1CCC(CC1)C(=O)c1cc(Cl)ccc1F
: