Target
G-protein coupled receptor 6
Ligand
BDBM190968
Substrate
Meas. Tech.
cAMP assay A.1
IC50
59500±n/a nM
Citation
 Brown, JWHitchcock, SHopkins, MKikuchi, SMonenschein, HReichard, HSchleicher, KSun, HMacklin, T Substituted pyrido[3,4-b]pyrazines as GPR6 modulators US Patent  US9708313 Publication Date 7/18/2017 
Target
Name:
G-protein coupled receptor 6
Synonyms:
G-protein coupled receptor 6 (GPR6) GPR6_HUMAN | Sphingosine 1-phosphate receptor GPR6
Type:
Protein
Mol. Mass.:
37886.39
Organism:
Homo sapiens (Human)
Description:
P46095
Residue:
362
  
Inhibitor
Name:
BDBM190968
Synonyms:
US10077266, Example 81 US9708313, 81
Type:
Small organic molecule
Emp. Form.:
C22H29F2N5O
Mol. Mass.:
417.4954
SMILES:
CC(C)Nc1nc2CCN(C)Cc2nc1N1CCC(CC1)Oc1ccc(F)cc1F
: