Target
G-protein coupled receptor 6
Ligand
BDBM191002
Substrate
Meas. Tech.
cAMP assay A.2
IC50
23900±n/a nM
Citation
 Brown, JWHitchcock, SHopkins, MKikuchi, SMonenschein, HReichard, HSchleicher, KSun, HMacklin, T Substituted pyrido[3,4-b]pyrazines as GPR6 modulators US Patent  US9708313 Publication Date 7/18/2017 
Target
Name:
G-protein coupled receptor 6
Synonyms:
G-protein coupled receptor 6 (GPR6) GPR6_HUMAN | Sphingosine 1-phosphate receptor GPR6
Type:
Protein
Mol. Mass.:
37886.39
Organism:
Homo sapiens (Human)
Description:
P46095
Residue:
362
  
Inhibitor
Name:
BDBM191002
Synonyms:
US10077266, Example 115 US9708313, 115
Type:
Small organic molecule
Emp. Form.:
C25H29F4N5O2
Mol. Mass.:
507.5237
SMILES:
CC1Cc2nc(NCC(F)F)c(nc2CN1C(=O)C1CC1)N1CCC(CC1)Oc1ccc(F)cc1F
: