Target
G-protein coupled receptor 6
Ligand
BDBM191005
Substrate
Meas. Tech.
cAMP assay A.1
IC50
11400±n/a nM
Citation
 Brown, JWHitchcock, SHopkins, MKikuchi, SMonenschein, HReichard, HSchleicher, KSun, HMacklin, T Substituted pyrido[3,4-b]pyrazines as GPR6 modulators US Patent  US9708313 Publication Date 7/18/2017 
Target
Name:
G-protein coupled receptor 6
Synonyms:
G-protein coupled receptor 6 (GPR6) GPR6_HUMAN | Sphingosine 1-phosphate receptor GPR6
Type:
Protein
Mol. Mass.:
37886.39
Organism:
Homo sapiens (Human)
Description:
P46095
Residue:
362
  
Inhibitor
Name:
BDBM191005
Synonyms:
US10077266, Example 118 US9708313, 118
Type:
Small organic molecule
Emp. Form.:
C23H28F3N5O
Mol. Mass.:
447.4965
SMILES:
CC(C)Nc1nc2CN(CCc2nc1N1CCC(CC1)[C@H](F)c1ccc(F)cc1F)C=O
: