Target
G-protein coupled receptor 6
Ligand
BDBM191028
Substrate
Meas. Tech.
cAMP assay A.1
IC50
122000±n/a nM
Citation
 Brown, JWHitchcock, SHopkins, MKikuchi, SMonenschein, HReichard, HSchleicher, KSun, HMacklin, T Substituted pyrido[3,4-b]pyrazines as GPR6 modulators US Patent  US9708313 Publication Date 7/18/2017 
Target
Name:
G-protein coupled receptor 6
Synonyms:
G-protein coupled receptor 6 (GPR6) GPR6_HUMAN | Sphingosine 1-phosphate receptor GPR6
Type:
Protein
Mol. Mass.:
37886.39
Organism:
Homo sapiens (Human)
Description:
P46095
Residue:
362
  
Inhibitor
Name:
BDBM191028
Synonyms:
US10077266, Example 140 US9708313, 140
Type:
Small organic molecule
Emp. Form.:
C24H30F2N6O2
Mol. Mass.:
472.5308
SMILES:
CC(=O)N1CCc2nc(N3CCN(Cc4ccc(F)cc4F)CC3)c(N[C@@H]3C[C@H](O)C3)nc2C1
: