Target
G-protein coupled receptor 6
Ligand
BDBM191033
Substrate
Meas. Tech.
cAMP assay A.1
IC50
185900±n/a nM
Citation
 Brown, JWHitchcock, SHopkins, MKikuchi, SMonenschein, HReichard, HSchleicher, KSun, HMacklin, T Substituted pyrido[3,4-b]pyrazines as GPR6 modulators US Patent  US9708313 Publication Date 7/18/2017 
Target
Name:
G-protein coupled receptor 6
Synonyms:
G-protein coupled receptor 6 (GPR6) GPR6_HUMAN | Sphingosine 1-phosphate receptor GPR6
Type:
Protein
Mol. Mass.:
37886.39
Organism:
Homo sapiens (Human)
Description:
P46095
Residue:
362
  
Inhibitor
Name:
BDBM191033
Synonyms:
US10077266, Example 145 US9708313, 145
Type:
Small organic molecule
Emp. Form.:
C24H29F3N6O
Mol. Mass.:
474.5219
SMILES:
CC(=O)N1CCc2nc(N3CCN(Cc4ccc(F)cc4F)CC3)c(N[C@H]3C[C@H](F)C3)nc2C1
: