Target
Interleukin-1 receptor-associated kinase 4
Ligand
BDBM380547
Substrate
Meas. Tech.
Kinase Assay
IC50
65.0±n/a nM
Citation
 Altman, MDBrubaker, JDChilders, MLDonofrio, AFischmann, TGibeau, CRKattar, SDLesburg, CALim, JMacLean, JKMansoor, UFNorthrup, ABSanders, JMSmith, GF Inhibitors of IRAK4 activity US Patent  US9926330 Publication Date 3/27/2018 
Target
Name:
Interleukin-1 receptor-associated kinase 4
Synonyms:
IRAK-4 IRAK4_HUMAN Interleukin-1 receptor-associated kinase 4 (IRAK4) | Renal carcinoma antigen NY-REN-64
Type:
Protein
Mol. Mass.:
51519.08
Organism:
Homo sapiens (Human)
Description:
Q9NWZ3
Residue:
460
  
Inhibitor
Name:
BDBM380547
Synonyms:
US9926330, 1-7
Type:
Small organic molecule
Emp. Form.:
C19H25N3O2
Mol. Mass.:
327.4207
SMILES:
Cc1ccc2ncnc(O[C@H]3CC[C@@H](CC3)N3CCOCC3)c2c1
: