Target
Interleukin-1 receptor-associated kinase 4
Ligand
BDBM380589
Substrate
Meas. Tech.
Kinase Assay
IC50
10.00±n/a nM
Citation
 Altman, MDBrubaker, JDChilders, MLDonofrio, AFischmann, TGibeau, CRKattar, SDLesburg, CALim, JMacLean, JKMansoor, UFNorthrup, ABSanders, JMSmith, GF Inhibitors of IRAK4 activity US Patent  US9926330 Publication Date 3/27/2018 
Target
Name:
Interleukin-1 receptor-associated kinase 4
Synonyms:
IRAK-4 IRAK4_HUMAN Interleukin-1 receptor-associated kinase 4 (IRAK4) | Renal carcinoma antigen NY-REN-64
Type:
Protein
Mol. Mass.:
51519.08
Organism:
Homo sapiens (Human)
Description:
Q9NWZ3
Residue:
460
  
Inhibitor
Name:
BDBM380589
Synonyms:
3-{4-[(trans-4- morpholin-4- ylcyclohexyl)amino]- quinazolin-6-yl}propan- 1-ol | US9926330, 5-2
Type:
Small organic molecule
Emp. Form.:
C21H30N4O2
Mol. Mass.:
370.4885
SMILES:
OCCCc1ccc2ncnc(N[C@H]3CC[C@@H](CC3)N3CCOCC3)c2c1
: