Target
Toll-like receptor 7
Ligand
BDBM380584
Substrate
EC50
5000±n/a nM
Citation
 Hoves, SKoerner, MWang, LYun, HZhu, WZhang, W Benzazepine sulfonamide compounds US Patent  US9890124 Publication Date 2/13/2018 
Target
Name:
Toll-like receptor 7
Synonyms:
ORF Names:UNQ248/PRO285 TLR7_HUMAN | Toll-like receptor 7 (TLR7)
Type:
Enzyme
Mol. Mass.:
120945.35
Organism:
Homo sapiens (Human)
Description:
Q9NYK1
Residue:
1049
  
Inhibitor
Name:
BDBM380584
Synonyms:
2-Amino-N,N-dipropyl-8-(5-sulfamoyl-3-pyridyl)-3H-1-benzazepine-4-carboxamide | US9890124, 4
Type:
Small organic molecule
Emp. Form.:
C22H27N5O3S
Mol. Mass.:
441.546
SMILES:
CCCN(CCC)C(=O)C1=Cc2ccc(cc2N=C(N)C1)-c1cncc(c1)S(N)(=O)=O
: