Target
Toll-like receptor 8
Ligand
BDBM380603
Substrate
Meas. Tech.
Pharmacological Assay
EC50
8.00±n/a nM
Citation
 Hoves, SKoerner, MWang, LYun, HZhu, WZhang, W Benzazepine sulfonamide compounds US Patent  US9890124 Publication Date 2/13/2018 
Target
Name:
Toll-like receptor 8
Synonyms:
CD_antigen: CD288 TLR8_HUMAN | TRL8
Type:
Enzyme
Mol. Mass.:
119828.77
Organism:
Homo sapiens (Human)
Description:
Q9NR97
Residue:
1041
  
Inhibitor
Name:
BDBM380603
Synonyms:
2-Amino-8-[3-(6-hydroxyhexylsulfamoyl)phenyl]-N,N-dipropyl-3H-1-benzazepine-4-carboxamide | US9890124, 12
Type:
Small organic molecule
Emp. Form.:
C29H40N4O4S
Mol. Mass.:
540.717
SMILES:
CCCN(CCC)C(=O)C1=Cc2ccc(cc2N=C(N)C1)-c1cccc(c1)S(=O)(=O)NCCCCCCO
: