Target
Toll-like receptor 8
Ligand
BDBM380605
Substrate
Meas. Tech.
Pharmacological Assay
EC50
9.00±n/a nM
Citation
 Hoves, SKoerner, MWang, LYun, HZhu, WZhang, W Benzazepine sulfonamide compounds US Patent  US9890124 Publication Date 2/13/2018 
Target
Name:
Toll-like receptor 8
Synonyms:
CD_antigen: CD288 TLR8_HUMAN | TRL8
Type:
Enzyme
Mol. Mass.:
119828.77
Organism:
Homo sapiens (Human)
Description:
Q9NR97
Residue:
1041
  
Inhibitor
Name:
BDBM380605
Synonyms:
2-Amino-8-[3-[(3R)-3-hydroxypyrrolidin-1-yl]sulfonyl-5-(trifluoromethyl)phenyl]-N,N-dipropyl-3H-1-benzazepine-4-carboxamide | US9890124, 14
Type:
Small organic molecule
Emp. Form.:
C28H33F3N4O4S
Mol. Mass.:
578.646
SMILES:
CCCN(CCC)C(=O)C1=Cc2ccc(cc2N=C(N)C1)-c1cc(cc(c1)S(=O)(=O)N1CC[C@@H](O)C1)C(F)(F)F
: