Target
Fibroblast growth factor receptor 4
Ligand
BDBM357709
Substrate
Meas. Tech.
Enzymatic Assay
IC50
<10±n/a nM
Citation
 Lu, LWu, LQian, DYao, W Bicyclic heterocycles as FGFR4 inhibitors US Patent  US9890156 Publication Date 2/13/2018 
Target
Name:
Fibroblast growth factor receptor 4
Synonyms:
CD_antigen: CD334 FGFR4 FGFR4 Fibroblast growth factor receptor JK2 TKF
Type:
Protein
Mol. Mass.:
87957.45
Organism:
Homo sapiens (Human)
Description:
P22455
Residue:
802
  
Inhibitor
Name:
BDBM357709
Synonyms:
N-((1-(cyclopropylmethyl)-3-(2,6-difluoro-3,5-dimethoxyphenyl)-2-oxo-1,2,3,4-tetrahydropyrido[4,3-d]pyrimidin-7-yl)methyl)acrylamide US10738048, Example 13 US11667635, Example 13 | US9890156, Example 13
Type:
Small organic molecule
Emp. Form.:
C23H24F2N4O4
Mol. Mass.:
458.4579
SMILES:
COc1cc(OC)c(F)c(N2Cc3cnc(CNC(=O)C=C)cc3N(CC3CC3)C2=O)c1F
: