Target
Fibroblast growth factor receptor 2
Ligand
BDBM357717
Substrate
Meas. Tech.
Enzymatic Assay
IC50
>200±n/a nM
Citation
 Lu, LWu, LQian, DYao, W Bicyclic heterocycles as FGFR4 inhibitors US Patent  US9890156 Publication Date 2/13/2018 
Target
Name:
Fibroblast growth factor receptor 2
Synonyms:
BEK FGFR-2 FGFR2 Fibroblast growth factor receptor 2 (FGFR2) KGFR Keratinocyte growth factor receptor VEGF-receptor 2 and Fibroblast growth factor receptor 2
Type:
Enzyme
Mol. Mass.:
92015.45
Organism:
Homo sapiens (Human)
Description:
P21802
Residue:
821
  
Inhibitor
Name:
BDBM357717
Synonyms:
N-((3-(2,6-difluoro-3,5-dimethoxyphenyl)-2-oxo-1-(2,2,2-trifluoroethyl)-1,2,3,4-tetrahydropyrido[4,3-d]pyrimidin-7-yl)methyl)acrylamide US10738048, Example 21 US11667635, Example 21 | US9890156, Example 21
Type:
Small organic molecule
Emp. Form.:
C21H19F5N4O4
Mol. Mass.:
486.392
SMILES:
COc1cc(OC)c(F)c(N2Cc3cnc(CNC(=O)C=C)cc3N(CC(F)(F)F)C2=O)c1F
: