Target
Fibroblast growth factor receptor 3
Ligand
BDBM357728
Substrate
Meas. Tech.
Enzymatic Assay
IC50
>200±n/a nM
Citation
 Lu, LWu, LQian, DYao, W Bicyclic heterocycles as FGFR4 inhibitors US Patent  US9890156 Publication Date 2/13/2018 
Target
Name:
Fibroblast growth factor receptor 3
Synonyms:
CD_antigen: CD333 FGFR3 Fibroblast growth factor receptor JTK4
Type:
Protein
Mol. Mass.:
87699.57
Organism:
Homo sapiens (Human)
Description:
P22607
Residue:
806
  
Inhibitor
Name:
BDBM357728
Synonyms:
N-((3-(2,6-difluoro-3,5-dimethoxyphenyl)-1-((1-methylpiperidin-4-yl)methyl)-2-oxo-1,2,3,4-tetrahydropyrido[4,3-d]pyrimidin-7-yl)methyl)acrylamide US10738048, Example 32 US11667635, Example 32 | US9890156, Example 32
Type:
Small organic molecule
Emp. Form.:
C26H31F2N5O4
Mol. Mass.:
515.5522
SMILES:
COc1cc(OC)c(F)c(N2Cc3cnc(CNC(=O)C=C)cc3N(CC3CCN(C)CC3)C2=O)c1F
: