Target
Fibroblast growth factor receptor 3
Ligand
BDBM357697
Substrate
Meas. Tech.
FGFR Enzymatic Assay 2
IC50
>200±n/a nM
Citation
 Lu, LWu, LQian, DYao, W Bicyclic heterocycles as FGFR4 inhibitors US Patent  US9890156 Publication Date 2/13/2018 
Target
Name:
Fibroblast growth factor receptor 3
Synonyms:
CD_antigen: CD333 FGFR3 Fibroblast growth factor receptor JTK4
Type:
Protein
Mol. Mass.:
87699.57
Organism:
Homo sapiens (Human)
Description:
P22607
Residue:
806
  
Inhibitor
Name:
BDBM357697
Synonyms:
N-{[2′-(2,6-difluoro-3,5-dimethoxyphenyl)-3′-oxo-2′,3′-dihydro-1′H-spiro[cyclopropane-1,4′-[2,7]naphthyridin]6′-yl]methyl}acrylamide US10738048, Example 1 US11667635, Example 1 | US9890156, Example 1
Type:
Small organic molecule
Emp. Form.:
C22H21F2N3O4
Mol. Mass.:
429.4166
SMILES:
COc1cc(OC)c(F)c(N2Cc3cnc(CNC(=O)C=C)cc3C3(CC3)C2=O)c1F
: