Target
Cyclin-A2/Cyclin-dependent kinase 2
Ligand
BDBM24648
Substrate
Histone H1
Meas. Tech.
CDK2/CyclinA Kinase Assay
pH
7.2±n/a
Temperature
295.15±n/a K
IC50
38±n/a nM
Citation
 Wyatt, PGWoodhead, AJBerdini, VBoulstridge, JACarr, MGCross, DMDavis, DJDevine, LAEarly, TRFeltell, RELewis, EJMcMenamin, RLNavarro, EFO'Brien, MAO'Reilly, MReule, MSaxty, GSeavers, LCSmith, DMSquires, MSTrewartha, GWalker, MTWoolford, AJ Identification of N-(4-piperidinyl)-4-(2,6-dichlorobenzoylamino)-1H-pyrazole-3-carboxamide (AT7519), a novel cyclin dependent kinase inhibitor using fragment-based X-ray crystallography and structure based drug design. J Med Chem 51:4986-99 (2008)  
Target
Name:
Cyclin-A2/Cyclin-dependent kinase 2
Synonyms:
CDK2-CyclinA CDK2/Cyclin A Cyclin A2/dependent kinase 2 Cyclin-Dependent Kinase 2 (CDK2A)
Type:
Protein Complex
Mol. Mass.:
Description:
Cdk2/Cyclin A kinase was purified from insect cells coinfected with Cyclin A/Cdk2 baculovirus.
Components:
This complex has 2 components.
Component 1
Name:
Cyclin-dependent kinase 2
Synonyms:
CDK2 CDK2_HUMAN Cell division protein kinase 2 Protein cereblon/Cyclin-dependent kinase 2 | p33 protein kinase
Type:
Enzyme Subunit
Mol. Mass.:
33938.17
Organism:
Homo sapiens (Human)
Description:
P24941
Residue:
298
  
Component 2
Name:
Cyclin-A2
Synonyms:
CCN1 CCNA1 CCNA2_HUMAN Cyclin-A
Type:
Enzyme Subunit
Mol. Mass.:
48550.19
Organism:
Homo sapiens (Human)
Description:
P20248
Residue:
432
  
Inhibitor
Name:
BDBM24648
Synonyms:
3-N-(4-aminocyclohexyl)-4-N-(2,6-difluorobenzene)-1H-pyrazole-3,4-diamido | pyrazole diamide, 27
Type:
Small organic molecule
Emp. Form.:
C17H19F2N5O2
Mol. Mass.:
363.3619
SMILES:
N[C@H]1CC[C@@H](CC1)NC(=O)c1[nH]ncc1NC(=O)c1c(F)cccc1F
:
Substrate
Name:
Histone H1
Synonyms:
Type:
Other Protein Type
Mol. Mass.:
358.43
Organism:
Bos taurus (bovine)
Description:
Residue:
3
NA