Target
Cyclin-dependent kinase/G2/mitotic-specific cyclin- 1
Ligand
BDBM24647
Substrate
Histone H1
Meas. Tech.
CDK2/CyclinA Kinase Assay
IC50
45±n/a nM
Citation
 Wyatt, PGWoodhead, AJBerdini, VBoulstridge, JACarr, MGCross, DMDavis, DJDevine, LAEarly, TRFeltell, RELewis, EJMcMenamin, RLNavarro, EFO'Brien, MAO'Reilly, MReule, MSaxty, GSeavers, LCSmith, DMSquires, MSTrewartha, GWalker, MTWoolford, AJ Identification of N-(4-piperidinyl)-4-(2,6-dichlorobenzoylamino)-1H-pyrazole-3-carboxamide (AT7519), a novel cyclin dependent kinase inhibitor using fragment-based X-ray crystallography and structure based drug design. J Med Chem 51:4986-99 (2008)  
Target
Name:
Cyclin-dependent kinase/G2/mitotic-specific cyclin- 1
Synonyms:
CDK1/B CDK1/CyclinB Cyclin-Dependent Kinase 1 (CDK1) Cyclin-dependent kinase/G2/mitotic-specific cyclin 1 | cdk1
Type:
Protein Complex
Mol. Mass.:
Description:
CDK1/Cyclin B complexes were purified from insect cells co-infected with baculovirus vectors containing each of the components.
Components:
This complex has 2 components.
Component 1
Name:
Cyclin-dependent kinase 1
Synonyms:
CDC2 CDK1 CDKN1 Cell division protein kinase 1 P34CDC2 | p34 protein kinase
Type:
Enzyme Subunit
Mol. Mass.:
34101.08
Organism:
Homo sapiens (Human)
Description:
P06493
Residue:
297
  
Component 2
Name:
G2/mitotic-specific cyclin-B1
Synonyms:
CCNB CCNB1_HUMAN
Type:
Enzyme Subunit
Mol. Mass.:
48340.95
Organism:
Homo sapiens (Human)
Description:
P14635
Residue:
433
  
Inhibitor
Name:
BDBM24647
Synonyms:
4-N-(2,6-difluorobenzene)-3-N-(4-hydroxycyclohexyl)-1H-pyrazole-3,4-diamido | pyrazole diamide, 26
Type:
Small organic molecule
Emp. Form.:
C17H18F2N4O3
Mol. Mass.:
364.3466
SMILES:
O[C@H]1CC[C@@H](CC1)NC(=O)c1[nH]ncc1NC(=O)c1c(F)cccc1F
:
Substrate
Name:
Histone H1
Synonyms:
Type:
Other Protein Type
Mol. Mass.:
358.43
Organism:
Bos taurus (bovine)
Description:
Residue:
3
NA